{"text_format":"1","workbook":"xlsx","n_sheets":14,"sheets":["Step 1 - Project Info","Dropdown","Direct Install - Unit Matrix","Air Sealing","Low Flow DHW","Dwelling Unit Lighting","Common and Exterior Lighting","Lighting Summary","Insulation","Window Replacements","Refrigerator Replacements","HVAC","Smart Thermostats","Custom Measure"],"not_rendered":{"charts":0,"images":2,"macros":1,"external_links":1,"defined_names":27,"comments":2,"pivot_tables":0},"unopened":[],"bounds":{"document_bytes":16777216,"sheet_cells":100000,"rows_first":2000,"rows_last":500,"rows_between":2000,"halvings":0,"cell_chars":16384,"cell_head_chars":4096},"cells_cut":0,"cells_raw":0,"read":"whole","date_system":"1900"}

{"sheet":"Step 1 - Project Info","index":0,"n_rows":53,"n_cols":4,"rows_kept":53,"cut":false,"hidden":false,"merged":[[41,0,41,1],[0,1,0,2],[1,1,1,2]]}
["Multifamily Initiative Project Fill Out Form"]
["Rev. 4/11/2022","PROJECT INFO"]
[null,"Property Name"]
[null,"Property Street Number"]
[null,"Property Street"]
[null,"Property Street Address Line 2"]
[null,"Property City"]
[null,"Property Zip Code"]
[null,"Customer Electric (Master) Account Number (required)"]
[null,"Customer Gas (Master) Account Number (required)"]
[null,"Customer Contact First Name (For LOA to be addressed to)"]
[null,"Customer Contact Last Name (For LOA to be addressed to)"]
[null,"Customer Contact Title"]
[null,"Customer Company Name"]
[null,"Customer Contact Phone Number"]
{"$rows_left_out":39}
{"sheet":"Dropdown","index":1,"n_rows":165,"n_cols":25,"rows_kept":165,"cut":false,"hidden":true,"merged":[[1,11,1,14],[1,16,1,22]]}
[]
[null,null,null,null,null,null,null,null,null,null,null,"Dwelling Unit Lighting",null,null,null,null,"HVAC",null,null,null,null,null,null,null,"Insulation"]
[null,"Competitive Resources, Inc., 60 Church Street, Suite #2, Yalesville, CT 06492",null,"Andover","Carl Watts","Multifamily Low-Rise Apartments 1-3 stories","None","None","Eversource Electric","Central AC",null,"Recessed","Recessed","New Fixtures","Standard Interior",null,"Electric Heater","Constant Volume","Individual","Electric Water Heater","Indirect","Pressure","Packaged DX"]
[null,"Handyman Express Energy Solutions, LLC, 1414 Barnum Avenue,Stratford, CT 06614",null,"Ansonia","Dana Forrester","Multifamily Mid-Rise Apartments 4 - 5 stories","Air Sealing","ALM ducts","UI Electric","Window AC",null,"Drum","Drum","Retrofit Fixtures","Standard Exterior",null,"Gas Boiler","Variable Speed","Central","Heat Pump Water Heater","Storage","Temperature","Chiller Plant",null,"Attic"]
[null,"New England Smart Energy Group, LLC, 34 Sherman Court, Fairfield, CT 06824",null,"Ashford","Natalia Sudyka","Multifamily High-Rise Apartments 6 stories or more","Low Flow DHW","ALM ducts and pipes","Eversource Gas","None",null,"Wrap","Wrap","Screw-in LED","High-Performance Interior",null,"Condensing Gas Boiler",null,null,"Gas Water Heater","Instananeous",null,"Ductless Mini Split",null,"Roof line/ Vaulted Ceiling"]
[null,"Santa Fuel, Inc., 154 Admiral Street, Bridgeport, CT 06605",null,"Avon","Alysse Rodrigues","Multifamily Apartments","Dwelling Unit Lighting","ALM pipes","CNG Gas","Other",null,"Troffer","Troffer","Controls Only","High-Performance Exterior",null,"Oil Boiler",null,null,"Oil Water Heater ","Stand Alone Non-Storage",null,"DX Split",null,"Foundation wall"]
[null,"Action for Bridgeport Community Development, 1070 Park Avenue, Bridegeport, CT 06604",null,"Barkhamsted",null,"Multifamily Townhouse","Common and Exterior Lighting","CO","SCG Gas",null,null,"Sconce","Sconce","Miscellaneous Costs",null,null,"HydroAir",null,null,"Propane Water Heater",null,null,"DX HP",null,"Basement Ceiling"]
[null,"The Access Agency, 1315 Main Street, Willimantic, CT 06226",null,"Beacon Falls",null,"Multifamily Other","Insulation","Customer refused","Prop. Gas",null,null,"Jelly Jar","Jelly Jar","Non-Eligible",null,null,"Propane Boiler",null,null,null,null,null,"Air Source Heat Pump",null,"Exterior Wall"]
[null,"Community Renewal Team, Inc., 555 Windsor Street, Hartford, CT 06120",null,"Berlin",null,null,"Window Replacements","Failed CAZ","Oil",null,null,"Square","Square",null,null,null,"Electric Furnace",null,null,null,null,null,"Watersource Heat Pump",null,"Crawlspace Wall"]
[null,"Energy Resources Group Technologies, Inc., 1831 Middletown Ave, Northford, CT, 06472",null,"Bethany",null,null,"Refrigerators Replacement","Failed spillage clean up","Other",null,null,"Cloud","Cloud",null,null,null,"Gas Furnace",null,null,null,null,null,"Ground Source Heat Pump",null,"Crawlspace Ceiling"]
[null,"New Opportunities, Inc., 232 North Elm Street, Waterbury, CT 06702",null,"Bethel",null,null,"HVAC & DHW Equipment","Gas leak customer side",null,null,null,"Strip","Strip",null,null,null,"Condensing Gas Furnace",null,null,null,null,null,"Window Unit",null,"Rim Joist"]
[null,"BantamWesson, 145 Railroad Hill St, Waterbury, CT 06708",null,"Bethlehem",null,null,"Smart Thermostats","Gas leak utility side",null,null,null,"Vanity","Vanity",null,null,null,"Oil Furnace",null,null,null,null,null,"Geothermal Heat Pump",null,"Attic Hatch Cover "]
[null,"CMC Energy Services, 4 Tower Dr, Wallingford, CT 06492 ",null,"Bloomfield",null,null,"Custom Measure","Gas leaks both sides",null,null,null,"Table Lamp","Table Lamp",null,null,null,"Propane Furnace",null,null,null,null,null,null,null,"Attic Pull Down Stairs Cover "]
[null,"Dynamic Building and Energy Solutions LLC, 183 Providence-New London Tpke, North Stonington, CT 06359",null,"Bolton",null,null,"Duct Sealing Custom","Lead",null,null,null,"Floor Lamp","Floor Lamp",null,null,null,"Ductless MiniSplit",null,null,null,null,null,null,null,"Attic Whole House Fan Cover "]
[null,"Energy Efficiency Solutions LLC, 77 Pierson Lane, Unit A, Windsor, CT 06095",null,"Bozrah",null,null,null,"Mold",null,null,null,"Keyless","Keyless",null,null,null,"Ducted Heat Pumps",null,null,null,null,null,null,null,"Attic Air Sealing"]
{"$rows_left_out":151}
{"sheet":"Direct Install - Unit Matrix","index":2,"n_rows":18,"n_cols":10,"rows_kept":18,"cut":false,"hidden":false,"merged":[[0,0,0,14]]}
[{"$f":"'Step 1 - Project Info'!$C$3&\" - \"&'Step 1 - Project Info'!$C$7","v":" - "}]
[]
["Instructions:"]
["Direct Install measures include the following dwelling unit measures assessed and implemented by a direct install contractor*: air sealing, duct sealing, domestic hot water saving measures (e.g., low flow shower heads, faucet aerators, pipe wrap), and light bulbs (for income eligible only)."]
["1) A 10% representative sampling of dwelling units across the multifamily property must be conducted to determine the energy savings opportunities. Units sampled should be 10% of each unit type based on # bedrooms/studios and location (e.g., top corner, top middle, bottom corner, bottom middle, middle floor corner, middle floor center, etc.)."]
["2) During sampling, a contractor will perform services in each of the identified sample units."]
["3) For each sample unit, please complete the below table which summarizes the measures performed during sampling."]
["4) For each sample unit, provide detailed information regarding measures installed during sampling on the applicable tabs generated within this Project Fillout Form."]
[]
["Total Units by Type","Quantity"]
["Efficiency/ Studio"]
["1 Bedrooms"]
["2 Bedrooms"]
["3 Bedrooms"]
["4 Bedrooms"]
{"$rows_left_out":4}
{"sheet":"Air Sealing","index":3,"n_rows":25,"n_cols":26,"rows_kept":25,"cut":false,"hidden":true,"merged":[[1,2,1,18],[8,14,8,16],[8,17,8,19],[8,20,8,22],[8,23,8,25],[7,14,7,25],[3,14,4,20],[7,5,8,12]]}
[]
[null,null,{"$f":"'Step 1 - Project Info'!$C$3&\" - \"&'Step 1 - Project Info'!$C$7","v":" - "}]
[]
[]
[null,null,"Total Number of Units",{"$f":"'Step 1 - Project Info'!C36","v":0}]
[null,null,"Total Sample Units",{"$f":"COUNTA('Direct Install - Unit Matrix'!C19:C38)","v":0}]
[null,null,"Number of Floors",0]
[null,null,"Number of Buildings",0,null,"Note: Units sampled should be 10% of each unit type unless the property is 20 units or less, then all units must be included below (# bedrooms/ Studios, Location (Top Corner, Top Middle, Bottom Corner, Bottom Middle, Mid Fl Corner, Mid Fl Center))",null,null,null,null,null,null,null,null,"AIR SEALING DETAIL"]
[null,null,"Name of Lead Technician w/ BPI Multifamily Certification & Any Other Technicians Performing Air Sealing",null,null,null,null,null,null,null,null,null,null,null,"(1) What was air sealed? Air sealing time and location on exterior or interior wall",null,null,"(2) What was air sealed? Air sealing time and location on exterior or interior wall",null,null,"(3) What was air sealed? Air sealing time and location on exterior or interior wall",null,null,"(4) What was air sealed? Air sealing time and location on exterior or interior wall"]
[null,null,"Sample Apt #","Is Entrance Door Interior/ Exterior?","Bedroom type (Studio, 1BDRM, etc..)","Unit Locations (Top, Corner, Bottom, Middle)","SqFT of Unit","Age (years) of Building","Number of Techs Air Sealing Per Unit","Total Hours per Unit ","Total Linear Feet of Sealing per Unit","Total Number Gaskets per Unit","Door Weather Stripped Per Linear Feet per Unit","Total Number of Door Sweeps per Unit","What was Air Sealed?","Air Sealing Time (Hours)","Interior Wall, Exterior Wall, Interior Ceiling, Attic Floor, Basement Ceiling, Interior Ceiling, Basement Exterior walls","What was Air Sealed?","Air Sealing Time (Hours)","Interior Wall, Exterior Wall, Interior Ceiling, Attic Floor, Basement Ceiling, Interior Ceiling, Basement Exterior walls","What was Air Sealed?","Air Sealing Time (Hours)","Interior Wall, Exterior Wall, Interior Ceiling, Attic Floor, Basement Ceiling, Interior Ceiling, Basement Exterior walls","What was Air Sealed?","Air Sealing Time (Hours)","Interior Wall, Exterior Wall, Interior Ceiling, Attic Floor, Basement Ceiling, Interior Ceiling, Basement Exterior walls"]
[null,"EXAMPLE","Unit 1","Interior","1 BDRM","TOP FL",1100,1980,2,0.75,120,4,10,2,"bottom and top plate/exterior wall",0.5,"exterior wall","Kitchen sink penetration",0.15,"interior wall","bathroom exhaust vent",0.1,"attic ceiling"]
[null,null,{"$f":"IFERROR(INDEX('Direct Install - Unit Matrix'!$C$19:$C$38,SMALL(IF('Direct Install - Unit Matrix'!$D$19:$D$38<>\"\",ROW('Direct Install - Unit Matrix'!$C$19:$C$38)-ROW('Direct Install - Unit Matrix'!C$19)+1),ROWS('Direct Install - Unit Matrix'!C$19:C20))),\"\")","v":""}]
[null,null,{"$f":"IFERROR(INDEX('Direct Install - Unit Matrix'!$C$19:$C$38,SMALL(IF('Direct Install - Unit Matrix'!$D$19:$D$38<>\"\",ROW('Direct Install - Unit Matrix'!$C$19:$C$38)-ROW('Direct Install - Unit Matrix'!C$19)+1),ROWS('Direct Install - Unit Matrix'!C$19:C21))),\"\")","v":""}]
[null,null,{"$f":"IFERROR(INDEX('Direct Install - Unit Matrix'!$C$19:$C$38,SMALL(IF('Direct Install - Unit Matrix'!$D$19:$D$38<>\"\",ROW('Direct Install - Unit Matrix'!$C$19:$C$38)-ROW('Direct Install - Unit Matrix'!C$19)+1),ROWS('Direct Install - Unit Matrix'!C$19:C22))),\"\")","v":""}]
[null,null,{"$f":"IFERROR(INDEX('Direct Install - Unit Matrix'!$C$19:$C$38,SMALL(IF('Direct Install - Unit Matrix'!$D$19:$D$38<>\"\",ROW('Direct Install - Unit Matrix'!$C$19:$C$38)-ROW('Direct Install - Unit Matrix'!C$19)+1),ROWS('Direct Install - Unit Matrix'!C$19:C23))),\"\")","v":""}]
{"$rows_left_out":11}
{"sheet":"Low Flow DHW","index":4,"n_rows":34,"n_cols":11,"rows_kept":34,"cut":false,"hidden":true,"merged":[[2,4,2,7]]}
[]
[]
[null,null,null,null,{"$f":"'Step 1 - Project Info'!$C$3&\" - \"&'Step 1 - Project Info'!$C$7","v":" - "}]
[]
[]
[null,null,null,null,"WATER MEASURES","Quantity","Cost per Measure","Total Cost",null,"MR Pricing","IE Pricing"]
[null,null,null,null,"Hand Held Showerhead",0,{"$f":"IF(D6=\"Market Rate\",J7,IF(D6=\"Income Eligible\",K7,0))","v":0},{"$f":"G7*F7","v":0},null,16.079999999999998,15.84]
["Flip & Swivel Aerator",null,null,null,"Install Low-Flow Showerhead",0,{"$f":"IF(D6=\"Market Rate\",J8,IF(D6=\"Income Eligible\",K8,0))","v":0},{"$f":"G8*F8","v":0},null,8.4700000000000006,8.2100000000000009]
["Hand Held Showerhead",null,null,null,"Install Low- Flow Aerator",0,{"$f":"IF(D6=\"Market Rate\",J9,IF(D6=\"Income Eligible\",K9,0))","v":0},{"$f":"G9*F9","v":0},null,3.51,4.18]
["Install Low- Flow Aerator",null,null,null,"Flip & Swivel Aerator",0,{"$f":"IF(D6=\"Market Rate\",J10,IF(D6=\"Income Eligible\",K10,0))","v":0},{"$f":"G10*F10","v":0},null,5.2,5.18]
["Install Low-Flow Showerhead",null,null,null,null,null,"Total Cost",{"$f":"SUM(H7:H10)","v":0}]
[]
[]
[]
[]
{"$rows_left_out":20}
{"sheet":"Dwelling Unit Lighting","index":5,"n_rows":177,"n_cols":22,"rows_kept":177,"cut":false,"hidden":true,"merged":[]}
[]
[null,null,"Date",{"$f":"TODAY()","v":"2022-06-17"},null,null,null,"Company and Auditor Name",null,null,null,null,null,null,"Total Units by Type","Quantity"]
[null,null,"Site Name",{"$f":"'Step 1 - Project Info'!C3","v":0},null,null,null,null,null,null,null,null,null,null,"Efficiency/ Studio",{"$f":"'Direct Install - Unit Matrix'!B11","v":0}]
[null,null,"Site Address",{"$f":"CONCATENATE('Step 1 - Project Info'!C4,\" \",'Step 1 - Project Info'!C5,\" \",'Step 1 - Project Info'!C7)","v":"  "},null,null,null,"Apartment Number",null,null,null,null,null,null,"1 Bedrooms",{"$f":"'Direct Install - Unit Matrix'!B12","v":0}]
[null,null,"Building Number",null,null,null,null,"# of Bedrooms",null,null,null,null,null,null,"2 Bedrooms",{"$f":"'Direct Install - Unit Matrix'!B13","v":0}]
[null,null,"See notes below",null,null,null,null,null,null,null,null,null,null,null,"3 Bedrooms",{"$f":"'Direct Install - Unit Matrix'!B14","v":0}]
[null,null,null,null,null,null,null,null,null,null,null,null,null,null,"4 Bedrooms",{"$f":"'Direct Install - Unit Matrix'!B15","v":0}]
[null,null,"Sample Unit #","Room Location","Existing Lamp Type","Existing Lamp Wattage","Existing Lamp Quantity","Existing Fixture Type","Existing Fixture Quantity","Existing Fixture Wattage","Proposed Lighting Measure","Proposed Fixture Type","Proposed Fixture Quantity","Proposed Fixture Wattage","Recommendation (Brand/Model Number):","Comments/Notes:","Estimated Quantity Needed",null,null,null,"Table of Estimated Fixtures and Bulbs","Number of Bulbs"]
[null,null,null,"Unit type and Unit number",null,null,null,null,null,null,null,null,null,null,null,null,null,null,null,null,"Recessed",{"$f":"SUMIF($L$11:$L$176,U9,$Q$11:$Q$159)","v":0}]
[null,null,null,"Example",null,null,null,null,null,null,null,null,null,null,null,null,null,null,null,null,"Drum",0]
["IF('Core Services - Unit Matrix'!$C$12=\"\",IF('Core Services - Unit Matrix'!$C$13=\"\",IF('Core Services - Unit Matrix'!$C$14=\"\",'Core Services - Unit Matrix'!$C$12\"\")","Example",{"$f":"IFERROR(INDEX('Direct Install - Unit Matrix'!$C$19:$C$38,SMALL(IF('Direct Install - Unit Matrix'!$G$19:$G$38<>\"\",ROW('Direct Install - Unit Matrix'!$C$19:$C$38)-ROW('Direct Install - Unit Matrix'!C$19)+1),ROWS('Direct Install - Unit Matrix'!C$19:C19))),\"\")","v":""},"Bedroom","CFL",13,2,"Drum",1,28,"New fixture","Floor Lamp",5,10,null,null,{"$f":"IFERROR(IF(C11<>\"\",(M11/COUNTA('Direct Install - Unit Matrix'!$G$19:$G$38))*'Step 1 - Project Info'!$C$36,\"\"),\"\")","v":""},null,null,null,"Wrap",0]
[null,"Example",{"$f":"IFERROR(INDEX('Direct Install - Unit Matrix'!$C$19:$C$38,SMALL(IF('Direct Install - Unit Matrix'!$G$19:$G$38<>\"\",ROW('Direct Install - Unit Matrix'!$C$19:$C$38)-ROW('Direct Install - Unit Matrix'!C$19)+1),ROWS('Direct Install - Unit Matrix'!C$19:C19))),\"\")","v":""},"Hallway","Inc",60,2,"Drum",1,120,"New fixture","Drum",2,10,null,null,{"$f":"IFERROR(IF(C12<>\"\",(M12/COUNTA('Direct Install - Unit Matrix'!$G$19:$G$38))*'Step 1 - Project Info'!$C$36,\"\"),\"\")","v":""},null,null,null,"Troffer",0]
[null,"Example",{"$f":"IFERROR(INDEX('Direct Install - Unit Matrix'!$C$19:$C$38,SMALL(IF('Direct Install - Unit Matrix'!$G$19:$G$38<>\"\",ROW('Direct Install - Unit Matrix'!$C$19:$C$38)-ROW('Direct Install - Unit Matrix'!C$19)+1),ROWS('Direct Install - Unit Matrix'!C$19:C19))),\"\")","v":""},"Living Room","CFL",13,2,"Drum",1,28,"New fixture","Drum",5,10,null,null,{"$f":"IFERROR(IF(C13<>\"\",(M13/COUNTA('Direct Install - Unit Matrix'!$G$19:$G$38))*'Step 1 - Project Info'!$C$36,\"\"),\"\")","v":""},null,null,null,"Sconce",0]
[null,"Example",{"$f":"IFERROR(INDEX('Direct Install - Unit Matrix'!$C$19:$C$38,SMALL(IF('Direct Install - Unit Matrix'!$G$19:$G$38<>\"\",ROW('Direct Install - Unit Matrix'!$C$19:$C$38)-ROW('Direct Install - Unit Matrix'!C$19)+1),ROWS('Direct Install - Unit Matrix'!C$19:C19))),\"\")","v":""},"Living Room","Inc",60,2,"Table Lamp",2,120,"Screw-in bulb","Jelly Jar",4,10,null,null,{"$f":"IFERROR(IF(C14<>\"\",(M14/COUNTA('Direct Install - Unit Matrix'!$G$19:$G$38))*'Step 1 - Project Info'!$C$36,\"\"),\"\")","v":""},null,null,null,"Jelly Jar",0]
[null,null,null,null,null,null,null,null,null,null,null,null,null,null,null,null,{"$f":"IFERROR(IF(C15<>\"\",(M15/COUNTA('Direct Install - Unit Matrix'!$G$19:$G$38))*'Step 1 - Project Info'!$C$36,\"\"),\"\")","v":""},null,null,null,"Square",0]
{"$rows_left_out":163}
{"sheet":"Common and Exterior Lighting","index":6,"n_rows":124,"n_cols":18,"rows_kept":124,"cut":false,"hidden":true,"merged":[[1,3,3,13],[1,14,3,15]]}
[]
[null,null,null,{"$f":"'Step 1 - Project Info'!$C$3&\" - \"&'Step 1 - Project Info'!$C$7","v":" - "},null,null,null,null,null,null,null,null,null,null,"Company and Auditor Name"]
[]
[]
[]
[]
[null,"Area Description","Unit Quantity Before","Description Before","Watts/ Unit Before","Annual Hours Before (Verify if over 6000)","Item Type - Select From Picklist ","Lighting Group Type - Select From Picklist\n(Hold Mouse on Cell H7 To View Descriptions)","Unit Quantity After","Description After","Proposed Fixture Manufacturer","Proposed Fixture Model Number ","DLC Product ID or ENERGY STAR ","\"NEW\" Occupancy Sensor Controlled? (Y or N)","Watts/ Unit After","Annual Hours After","Installed Cost/ Fixture","Total Cost/ Group"]
["Example","Exterior Pole Lights",465,"70W High Pressure Sodium",95,4004,"Retrofit Fixtures","High-Performance Exterior",250," 20W LED Wallpack","MaxLite",123456789,"ENERGY STAR","Y",20,{"$f":"IF(N8=\"Y\",F8*0.7,F8)","v":2802.7999999999997},50,{"$f":"IF(G8=\"Non-Eligible\",0,IF(I8*Q8=0,\"\",(I8*(Q8))))","v":12500}]
[null,null,null,null,null,null,null,null,null,null,null,null,null,null,null,null,null,""]
[null,null,null,null,null,null,null,null,null,null,null,null,null,null,null,null,null,{"$f":"IF(G10=\"Non-Eligible\",0,IF(I10*Q10=0,\"\",(I10*(Q10))))","v":""}]
[null,null,null,null,null,null,null,null,null,null,null,null,null,null,null,null,null,{"$f":"IF(G11=\"Non-Eligible\",0,IF(I11*Q11=0,\"\",(I11*(Q11))))","v":""}]
[null,null,null,null,null,null,null,null,null,null,null,null,null,null,null,null,null,""]
[null,null,null,null,null,null,null,null,null,null,null,null,null,null,null,null,null,""]
[null,null,null,null,null,null,null,null,null,null,null,null,null,null,null,null,null,""]
[null,null,null,null,null,null,null,null,null,null,null,null,null,null,null,null,null,""]
{"$rows_left_out":110}
{"sheet":"Lighting Summary","index":7,"n_rows":42,"n_cols":10,"rows_kept":42,"cut":false,"hidden":true,"merged":[[1,3,3,7],[5,2,7,8],[4,1,4,8]]}
[]
[null,null,null,{"$f":"'Step 1 - Project Info'!$C$3&\" - \"&'Step 1 - Project Info'!$C$7","v":" - "}]
[]
[]
[null,"Note: PLEASE SPECIFY MISCELLANEOUS COST ASSOCIATED WITH LIGHTING INSTALLATION. THE PURPOSE OF THIS TAB IS TO SUMMARIZE THE LIGHTING THAT IS BEING PROPOSED TO BE INSTALLED THROUGHOUT THE ENTIRE PROPERTY."]
[null,null,"TOTAL LIGHTING QUANTITY THE BUILDING NEEDS TO BE SERVICED"]
[]
[]
[null,"Dwelling Unit"]
[null,"Existing Bulb Name","Existing Bulb Wattage","Recommended Bulb Name/ Model","Proposed Bulb Wattage","Quantity","Location","Material cost","Labor  Cost","Total Cost "]
["Example","CFL",13,"New fixture",10,5,"Hallway",100,27,{"$f":"IFERROR((H11+I11)*F11,\"\")","v":635}]
[]
[]
[]
[]
{"$rows_left_out":28}
{"sheet":"Insulation","index":8,"n_rows":7,"n_cols":10,"rows_kept":7,"cut":false,"hidden":true,"merged":[[2,2,4,8]]}
[]
[]
[null,null,{"$f":"'Step 1 - Project Info'!$C$3&\" - \"&'Step 1 - Project Info'!$C$7","v":" - "}]
[]
[]
[]
[null,"Location","Square Footage of Insulation (Linear feet for attic air sealing)","Existing Insulation Type","Existing Insulation Thickness (Inches)","Existing Insulation R-value","Proposed Insulation Type","Proposed Insulation Thickness (Inches)","Proposed Installed Insulation R-value ","Proposed Project Cost"]

{"sheet":"Window Replacements","index":9,"n_rows":10,"n_cols":15,"rows_kept":10,"cut":false,"hidden":true,"merged":[[1,5,3,11]]}
[]
[null,null,null,null,null,{"$f":"'Step 1 - Project Info'!$C$3&\" - \"&'Step 1 - Project Info'!$C$7","v":" - "}]
[]
[]
[]
[]
[null,null,null,"EXISTING WINDOW TYPES","PROPOSED MANUFACTURER AND MODEL NUMBER","CPD NUMBER","PROPOSED U-VALUE","WIDTH","LENGTH","QUANTITY"," TOTAL AREA","PROPOSED WINDOW TYPE","PROPOSED WINDOW MATERIAL COST","PROPOSED WINDOW LABOR COST","TOTAL COST"]
[null,"Single Pane without Storm"]
[null,"Single Pane with Storm"]
[null,"Double Pane"]

{"sheet":"Refrigerator Replacements","index":10,"n_rows":15,"n_cols":13,"rows_kept":15,"cut":false,"hidden":true,"merged":[[1,2,1,12],[2,9,2,12],[2,4,2,8]]}
[]
[null,null,{"$f":"'Step 1 - Project Info'!$C$3&\" - \"&'Step 1 - Project Info'!$C$7","v":" - "}]
[null,null,null,null,"Existing Units",null,null,null,null,"Proposed Units"]
[null,null,"Number of Refrigerators","Unit #","Age","Make","Size (cubic ft)","Model","KWH","Model","Size (cubic ft)"," KWH","Cost"]
[null,"Example",10,"A101","15 yrs","Hotpoint",14,"CTH14CYBRLWW",499,"FFHT1513LW",15,355,574]
[]
[]
[]
[]
[null,null," ",null," "," "," "," "," "," "," "," "," "]
[null,null,null,null,null,null,null,null,{"$f":"SUM(I5:I9)","v":499},null,null,{"$f":"SUM(L5:L9)","v":355},{"$f":"SUM(M5:M9)","v":574}]
[]
[null,null,null,null,null,null,null,"∆kWh = ",{"$f":"I11-L11","v":144}]
[null,null,null,null,null,null,null,"Est. Savings = "]
[null,null,null,null,null,null,null,"Est. Payback = "]
{"$rows_left_out":1}
{"sheet":"HVAC","index":11,"n_rows":70,"n_cols":18,"rows_kept":70,"cut":false,"hidden":false,"merged":[[10,4,11,13],[1,3,3,16],[69,6,70,15],[18,2,19,5],[20,2,20,5],[69,2,70,5],[31,2,32,5],[33,2,33,5],[57,2,58,5],[59,2,59,5],[36,4,37,12],[22,4,23,15],[61,4,62,12],[49,4,50,12]]}
[]
[null,null,null,{"$f":"'Step 1 - Project Info'!$C$3&\" - \"&'Step 1 - Project Info'!$C$7","v":" - "}]
[]
[]
[]
[]
[]
[]
[]
[]
[null,null,null,null,"HEATING SYSTEM"]
[]
[null,null,"LOCATION","INDIVIDUAL OR CENTRAL SYSTEM","AGE","EXISTING HEATING SYSTEM TYPE","MODEL NUMBER","EXISTING SIZE (INPUT MBTU)","EXISTING EFFICIENCY (AFUE or HSPF)","PROPOSED HEATING TYPE","INDIVIDUAL OR CENTRAL SYSTEM","MANUFACTURER & MODEL NUMBER","SIZE (INPUT MBTU)","PROPOSED EFFICIENCY (AFUE or HSPF)","QUANTITY","PROJECT COST"]
[]
[]
{"$rows_left_out":56}
{"sheet":"Smart Thermostats","index":12,"n_rows":11,"n_cols":9,"rows_kept":11,"cut":false,"hidden":true,"merged":[[1,4,3,10],[8,3,9,7]]}
[]
[null,null,null,null,{"$f":"'Step 1 - Project Info'!$C$3&\" - \"&'Step 1 - Project Info'!$C$7","v":" - "}]
[]
[]
[]
[]
[]
[]
[null,null,null,"Smart Thermostats"]
[]
[null,null,"LOCATION TYPE (dwelling unit/common area)","QUANTITY","MANUFACTURER","MODEL NUMBER","CENTRAL AC SYSTEM (Yes/No)","EXISTING HEATING SYSTEM TYPE","PROJECT COST (Labor & Material)"]

{"sheet":"Custom Measure","index":13,"n_rows":9,"n_cols":13,"rows_kept":9,"cut":false,"hidden":true,"merged":[[6,5,7,8],[1,2,2,8]]}
[]
[null,null,{"$f":"'Step 1 - Project Info'!$C$3&\" - \"&'Step 1 - Project Info'!$C$7","v":" - "}]
[]
[]
[]
[]
[null,null,null,null,null,"Custom Measure Details"]
[]
[null,"LOCATION","EXISTING MEASURE","MODEL NUMBER","AGE","ADDITIONAL DETAIL ON EXISTING MEASURE","ADDITIONAL DETAIL ON EXISTING MEASURE","Existing Measure Quantity","PROPOSED MEASURE","ADDITIONAL DETAIL ON EXISTING MEASURE","ADDITIONAL DETAIL ON EXISTING MEASURE","Proposed Measure Quantity","PROJECT COST"]